position,composer,work,performer,date-display,catalogue,matrix-num,cat-num,venue,label,producer-engineer,page,volume,sound-file,
"1","Oakley","Marche de concert Oakley","OLLY OAKLEY (banjo solo) p","8-12-10","kelly ","12878e","X-46292",,"HMV",,,,,
"2","Oakley","Marche de concert Oakley","OLLY OAKLEY (banjo solo) p","8-12-10","kelly ","12879e",,,"HMV",,,,,
"3","Oakley","Dashwood, Quickstep Oakley","OLLY OAKLEY (banjo solo) p","9-12-10","kelly ","12893e",,,"HMV",,,,,
"4","Oakley","Dashwood, Quickstep Oakley","OLLY OAKLEY (banjo solo) p","9-12-10","kelly ","12894e",,,"HMV",,,,,
"5","Oakley","Rosamond, Waltz Oakley","OLLY OAKLEY (banjo solo) p","9-12-10","kelly ","12896e",,,"HMV",,,,,
"6","Oakley","Devil-may-care, Quickstep Oakley","OLLY OAKLEY (banjo solo) p","6-3-13","kelly ","ab 16376e",,,"HMV",,,,,
"7","Oakley","Marche de concert Oakley","OLLY OAKLEY (banjo solo) p","6-3-13","kelly ","ab 16378e",,,"HMV",,,,,
"8","Oakley","Devil-may-care, Quickstep Oakley","OLLY OAKLEY (banjo solo) p","6-3-13","kelly ","ab 16381e","X-46309",,"HMV",,,,,
"9","Oakley","Summer dance Oakley","OLLY OAKLEY as FRED TURNER (banjo solo) p","20-10-09","kelly ","10870e",,,"HMV",,,,,
